Reaction Details
TargetC-C chemokine receptor type 5
LigandBDBM50321682
Substrate/Competitorn/a
Meas. Tech.ChEMBL_639942 (CHEMBL1174016)
IC50 2.9±n/a nM
Citation Ben, LJones, EDZhou, ELi, CBaylis, DCYu, SWang, MHe, XCoates, JARhodes, DIPei, GDeadman, JJXie, XMa, D Studies on the structure-activity relationship of 1,3,3,4-tetra-substituted pyrrolidine embodied CCR5 receptor antagonists. Part 1: Tuning the N-substituents. Bioorg Med Chem Lett20:4012-4 (2010) 
 
C-C chemokine receptor type 5
Name:C-C chemokine receptor type 5
Type:Enzyme
Mol. Mass.:40540.21
Organism:Homo sapiens (Human)
Description:P51681
Residue:352
BDBM50321682
NameBDBM50321682
Synonyms:CHEMBL1172035 | nifeviroc
TypeSmall organic molecule
Emp. Form.C33H42N4O6
Mol. Mass.590.7098
SMILESO[C@@]1(CN(C[C@@H]1CN1CCC(CC1)N(CC=C)C(=O)OCc1ccc(cc1)[N+]([O-])=O)C(=O)C1CCCC1)c1ccccc1