Reaction Details
TargetHistamine H3 receptor
LigandBDBM50321818
Substrate/Competitorn/a
Meas. Tech.ChEMBL_643311 (CHEMBL1177482)
Ki>1000±n/a nM
Citation Ishikawa, MFuruuchi, TYamauchi, MYokoyama, FKakui, NSato, Y Synthesis and structure-activity relationships of N-aryl-piperidine derivatives as potent (partial) agonists for human histamine H3 receptor. Bioorg Med Chem18:5441-8 (2010) 
 
Histamine H3 receptor
Name:Histamine H3 receptor
Type:G Protein-Coupled Receptor (GPCR)
Mol. Mass.:48691.47
Organism:Homo sapiens (Human)
Description:Binding assays were using CHO cells stably expressing hH3R receptors.
Residue:445
BDBM50321818
NameBDBM50321818
Synonyms:1-((1H-Imidazol-4-yl)methyl)-4-(4-trifluoromethylphenyl)-piperazine | CHEMBL1173807
TypeSmall organic molecule
Emp. Form.C15H17F3N4
Mol. Mass.310.3175
SMILESFC(F)(F)c1ccc(cc1)N1CCN(Cc2cnc[nH]2)CC1