Reaction Details
TargetHistamine H3 receptor
LigandBDBM50321813
Substrate/Competitorn/a
Meas. Tech.ChEMBL_643311 (CHEMBL1177482)
Ki 1±n/a nM
Citation Ishikawa, MFuruuchi, TYamauchi, MYokoyama, FKakui, NSato, Y Synthesis and structure-activity relationships of N-aryl-piperidine derivatives as potent (partial) agonists for human histamine H3 receptor. Bioorg Med Chem18:5441-8 (2010) 
 
Histamine H3 receptor
Name:Histamine H3 receptor
Type:G Protein-Coupled Receptor (GPCR)
Mol. Mass.:48691.47
Organism:Homo sapiens (Human)
Description:Binding assays were using CHO cells stably expressing hH3R receptors.
Residue:445
BDBM50321813
NameBDBM50321813
Synonyms:4-((1H-Imidazol-4-yl)methyl)-1-(3-isopropylphenyl)piperidine | CHEMBL1172774
TypeSmall organic molecule
Emp. Form.C18H25N3
Mol. Mass.283.4112
SMILESCC(C)c1cccc(c1)N1CCC(Cc2cnc[nH]2)CC1