Reaction Details
TargetHistamine H3 receptor
LigandBDBM50321826
Substrate/Competitorn/a
Meas. Tech.ChEMBL_643312 (CHEMBL1177483)
EC50 1.7±n/a nM
Citation Ishikawa, MFuruuchi, TYamauchi, MYokoyama, FKakui, NSato, Y Synthesis and structure-activity relationships of N-aryl-piperidine derivatives as potent (partial) agonists for human histamine H3 receptor. Bioorg Med Chem18:5441-8 (2010) 
 
Histamine H3 receptor
Name:Histamine H3 receptor
Type:G Protein-Coupled Receptor (GPCR)
Mol. Mass.:48691.47
Organism:Homo sapiens (Human)
Description:Binding assays were using CHO cells stably expressing hH3R receptors.
Residue:445
BDBM50321826
NameBDBM50321826
Synonyms:4-(4-((1H-Imidazol-4-yl)methyl)piperidin-1-yl)-N-methylaniline | CHEMBL1169687
TypeSmall organic molecule
Emp. Form.C16H22N4
Mol. Mass.270.3727
SMILESCNc1ccc(cc1)N1CCC(Cc2cnc[nH]2)CC1