Reaction Details
TargetHistamine H4 receptor
LigandBDBM50317865
Substrate/Competitorn/a
Meas. Tech.ChEMBL_643318 (CHEMBL1177489)
Ki 1.1±n/a nM
Citation Ishikawa, MFuruuchi, TYamauchi, MYokoyama, FKakui, NSato, Y Synthesis and structure-activity relationships of N-aryl-piperidine derivatives as potent (partial) agonists for human histamine H3 receptor. Bioorg Med Chem18:5441-8 (2010) 
 
Histamine H4 receptor
Name:Histamine H4 receptor
Type:G Protein-Coupled Receptor (GPCR)
Mol. Mass.:44517.02
Organism:Homo sapiens (Human)
Description:Binding assays were using CHO cells stably expressing hH4R receptors.
Residue:390
BDBM50317865
NameBDBM50317865
Synonyms:2-(2-(4-tert-Butylphenylthio)ethyl)-1H-imidazole CHEMBL1098230
TypeSmall organic molecule
Emp. Form.C15H20N2S
Mol. Mass.260.398
SMILESCC(C)(C)c1ccc(SCCc2cnc[nH]2)cc1