Reaction Details
TargetTransient receptor potential cation channel subfamily V member 1
LigandBDBM50321845
Substrate/Competitorn/a
Meas. Tech.ChEMBL_641610 (CHEMBL1176312)
IC50 15±n/a nM
Citation Perner, RJKoenig, JRDidomenico, SGomtsyan, ASchmidt, RGLee, CHHsu, MCMcDonald, HAGauvin, DMJoshi, STurner, TMReilly, RMKym, PRKort, ME Synthesis and biological evaluation of 5-substituted and 4,5-disubstituted-2-arylamino oxazole TRPV1 antagonists. Bioorg Med Chem18:4821-9 (2011) 
 
Transient receptor potential cation channel subfamily V member 1
Name:Transient receptor potential cation channel subfamily V member 1
Type:Protein
Mol. Mass.:94960.75
Organism:Homo sapiens (Human)
Description:Q8NER1
Residue:839
BDBM50321845
NameBDBM50321845
Synonyms:8-[5-(4-Chlorophenyl)oxazol-2-ylamino]-1,2,3,4-tetrahydronaphthalen-2-ol | CHEMBL1172740
TypeSmall organic molecule
Emp. Form.C19H17ClN2O2
Mol. Mass.340.803
SMILESOC1CCc2cccc(Nc3ncc(o3)-c3ccc(Cl)cc3)c2C1