Reaction Details
TargetZinc finger protein GLI1
LigandBDBM50321859
Substrate/Competitorn/a
Meas. Tech.ChEMBL_641630 (CHEMBL1176449)
IC50 1600±n/a nM
Citation Mahindroo, NConnelly, MCPunchihewa, CYang, LYan, BFujii, N Amide conjugates of ketoprofen and indole as inhibitors of Gli1-mediated transcription in the Hedgehog pathway. Bioorg Med Chem18:4801-11 (2011) 
 
Zinc finger protein GLI1
Name:Zinc finger protein GLI1
Type:PROTEIN
Mol. Mass.:117920.33
Organism:Homo sapiens (Human)
Description:ChEMBL_537531
Residue:1106
BDBM50321859
NameBDBM50321859
Synonyms:2-(3-Benzoylphenyl)-N-(1H-indol-5-yl)-N-propylpropanamide | CHEMBL1172835
TypeSmall organic molecule
Emp. Form.C27H26N2O2
Mol. Mass.410.5075
SMILESCCCN(C(=O)C(C)c1cccc(c1)C(=O)c1ccccc1)c1ccc2[nH]ccc2c1