Reaction Details
TargetProlyl endopeptidase
LigandBDBM50038879
Substrate/Competitorn/a
Meas. Tech.ChEMBL_641964 (CHEMBL1176041)
Ki 4.3±n/a nM
Citation Racys, DTRea, DFülöp, VWills, M Inhibition of prolyl oligopeptidase with a synthetic unnatural dipeptide. Bioorg Med Chem18:4775-82 (2011) 
 
Prolyl endopeptidase
Name:Prolyl endopeptidase
Type:Enzyme
Mol. Mass.:80688.50
Organism:Homo sapiens (Human)
Description:P48147
Residue:710
BDBM50038879
NameBDBM50038879
Synonyms:(S)-2-(2-Formyl-pyrrolidine-1-carbonyl)-pyrrolidine-1-carboxylic acid benzyl ester JTP-4819 | Z-PRO-PROLINAL
TypeSmall organic molecule
Emp. Form.C18H22N2O4
Mol. Mass.330.3783
SMILESO=C[C@@H]1CCCN1C(=O)[C@@H]1CCCN1C(=O)OCc1ccccc1