Reaction Details
Target5-hydroxytryptamine receptor 2C
LigandBDBM50321890
Substrate/Competitorn/a
Meas. Tech.ChEMBL_642099 (CHEMBL1176403)
Ki 2±n/a nM
Citation Cummings, DFCanseco, DCSheth, PJohnson, JESchetz, JA Synthesis and structure-affinity relationships of novel small molecule natural product derivatives capable of discriminating between serotonin 5-HT1A, 5-HT2A, 5-HT2C receptor subtypes. Bioorg Med Chem18:4783-92 (2011) 
 
5-hydroxytryptamine receptor 2C
Name:5-hydroxytryptamine receptor 2C
Type:G Protein-Coupled Receptor (GPCR)
Mol. Mass.:51836.79
Organism:Homo sapiens (Human)
Description:P28335
Residue:458
BDBM50321890
NameBDBM50321890
Synonyms:5,6-Dichloro-2,3-dihydro-indole-1-carboxylic acid [6-(2-methyl-pyridin-3-yloxy)-pyridin-3-yl]-amide CHEMBL301784
TypeSmall organic molecule
Emp. Form.C20H16Cl2N4O2
Mol. Mass.415.273
SMILESCc1ncccc1Oc1ccc(NC(=O)N2CCc3cc(Cl)c(Cl)cc23)cn1