Reaction Details
Target5-hydroxytryptamine receptor 2C
LigandBDBM50321873
Substrate/Competitorn/a
Meas. Tech.ChEMBL_642099 (CHEMBL1176403)
Ki 7.9±n/a nM
Citation Cummings, DFCanseco, DCSheth, PJohnson, JESchetz, JA Synthesis and structure-affinity relationships of novel small molecule natural product derivatives capable of discriminating between serotonin 5-HT1A, 5-HT2A, 5-HT2C receptor subtypes. Bioorg Med Chem18:4783-92 (2011) 
 
5-hydroxytryptamine receptor 2C
Name:5-hydroxytryptamine receptor 2C
Type:G Protein-Coupled Receptor (GPCR)
Mol. Mass.:51836.79
Organism:Homo sapiens (Human)
Description:P28335
Residue:458
BDBM50321873
NameBDBM50321873
Synonyms:4-Bromo-5-methyl-2,3-dihydro-indole-1-carboxylic acid pyridin-3-ylamide CHEMBL42463
TypeSmall organic molecule
Emp. Form.C15H14BrN3O
Mol. Mass.332.195
SMILESCc1ccc2N(CCc2c1Br)C(=O)Nc1cccnc1