Reaction Details
TargetVascular endothelial growth factor receptor 3
LigandBDBM50321903
Substrate/Competitorn/a
Meas. Tech.ChEMBL_642156 (CHEMBL1176707)
IC50>1000±n/a nM
Citation Khanwelkar, RRChen, GSWang, HCYu, CWHuang, CHLee, OChen, CHHwang, CSKo, CHChou, NTLin, MWWang, LMChen, YCHseu, THChang, CNHsu, HCLin, HCShih, YCChou, SHTseng, HWLiu, CPTu, CMHu, TLTsai, YJChern, JW Synthesis and structure-activity relationship of 6-arylureido-3-pyrrol-2-ylmethylideneindolin-2-one derivatives as potent receptor tyrosine kinase inhibitors. Bioorg Med Chem18:4674-86 (2011) 
 
Vascular endothelial growth factor receptor 3
Name:Vascular endothelial growth factor receptor 3
Type:Protein
Mol. Mass.:152749.58
Organism:Homo sapiens (Human)
Description:P35916-2
Residue:1363
BDBM50321903
NameBDBM50321903
Synonyms:(Z)-5-((6-(3-(4-methoxyphenyl)ureido)-2-oxoindolin-3-ylidene)methyl)-1H-pyrrole-2-carboxylic acid | CHEMBL1173244
TypeSmall organic molecule
Emp. Form.C22H18N4O5
Mol. Mass.418.4021
SMILESCOc1ccc(NC(=O)Nc2ccc3\C(=C\c4ccc([nH]4)C(O)=O)C(=O)Nc3c2)cc1