Reaction Details
TargetMast/stem cell growth factor receptor Kit
LigandBDBM50321906
Substrate/Competitorn/a
Meas. Tech.ChEMBL_642159 (CHEMBL1176710)
IC50 14±n/a nM
Citation Khanwelkar, RRChen, GSWang, HCYu, CWHuang, CHLee, OChen, CHHwang, CSKo, CHChou, NTLin, MWWang, LMChen, YCHseu, THChang, CNHsu, HCLin, HCShih, YCChou, SHTseng, HWLiu, CPTu, CMHu, TLTsai, YJChern, JW Synthesis and structure-activity relationship of 6-arylureido-3-pyrrol-2-ylmethylideneindolin-2-one derivatives as potent receptor tyrosine kinase inhibitors. Bioorg Med Chem18:4674-86 (2011) 
 
Mast/stem cell growth factor receptor Kit
Name:Mast/stem cell growth factor receptor Kit
Type:Protein
Mol. Mass.:109869.37
Organism:Homo sapiens (Human)
Description:P10721
Residue:976
BDBM50321906
NameBDBM50321906
Synonyms:(Z)-1-[2-Oxo-3-(1H-pyrrol-2-ylmethylene)-2,3-dihydro-1H-indol-6-yl]-3-(p-tolyl)-urea | CHEMBL1172815
TypeSmall organic molecule
Emp. Form.C21H18N4O2
Mol. Mass.358.3932
SMILESCc1ccc(NC(=O)Nc2ccc3\C(=C\c4ccc[nH]4)C(=O)Nc3c2)cc1