Reaction Details
TargetReceptor-type tyrosine-protein kinase FLT3
LigandBDBM50321897
Substrate/Competitorn/a
Meas. Tech.ChEMBL_642158 (CHEMBL1176709)
IC50 98±n/a nM
Citation Khanwelkar, RRChen, GSWang, HCYu, CWHuang, CHLee, OChen, CHHwang, CSKo, CHChou, NTLin, MWWang, LMChen, YCHseu, THChang, CNHsu, HCLin, HCShih, YCChou, SHTseng, HWLiu, CPTu, CMHu, TLTsai, YJChern, JW Synthesis and structure-activity relationship of 6-arylureido-3-pyrrol-2-ylmethylideneindolin-2-one derivatives as potent receptor tyrosine kinase inhibitors. Bioorg Med Chem18:4674-86 (2011) 
 
Receptor-type tyrosine-protein kinase FLT3
Name:Receptor-type tyrosine-protein kinase FLT3
Type:Enzyme
Mol. Mass.:112888.62
Organism:Homo sapiens (Human)
Description:P36888
Residue:993
BDBM50321897
NameBDBM50321897
Synonyms:(Z)-5-{6-[3-(4-Chlorophenyl)-ureido]-2-oxo-1,2-dihydroindol-3-ylidene-methyl}-2,4-dimethyl-1H-pyrrole-3-carboxylic acid | CHEMBL1172421
TypeSmall organic molecule
Emp. Form.C23H19ClN4O4
Mol. Mass.450.874
SMILESCc1[nH]c(\C=C2/C(=O)Nc3cc(NC(=O)Nc4ccc(Cl)cc4)ccc23)c(C)c1C(O)=O