Reaction Details
TargetVascular endothelial growth factor receptor 2
LigandBDBM50321892
Substrate/Competitorn/a
Meas. Tech.ChEMBL_642157 (CHEMBL1176708)
IC50 0.500000±n/a nM
Citation Khanwelkar, RRChen, GSWang, HCYu, CWHuang, CHLee, OChen, CHHwang, CSKo, CHChou, NTLin, MWWang, LMChen, YCHseu, THChang, CNHsu, HCLin, HCShih, YCChou, SHTseng, HWLiu, CPTu, CMHu, TLTsai, YJChern, JW Synthesis and structure-activity relationship of 6-arylureido-3-pyrrol-2-ylmethylideneindolin-2-one derivatives as potent receptor tyrosine kinase inhibitors. Bioorg Med Chem18:4674-86 (2011) 
 
Vascular endothelial growth factor receptor 2
Name:Vascular endothelial growth factor receptor 2
Type:Receptor Tyrosine Kinase
Mol. Mass.:151510.97
Organism:Homo sapiens (Human)
Description:P35968
Residue:1356
BDBM50321892
NameBDBM50321892
Synonyms:(Z)-5-{6-[3-(4-Methoxyphenyl)-ureido]-2-oxo-1,2-dihydroindol-3-ylidene-methyl}-4-methyl-1H-pyrrole-3-carboxylic acid | CHEMBL1173411
TypeSmall organic molecule
Emp. Form.C23H20N4O5
Mol. Mass.432.4287
SMILESCOc1ccc(NC(=O)Nc2ccc3\C(=C\c4[nH]cc(C(O)=O)c4C)C(=O)Nc3c2)cc1