Reaction Details
TargetVascular endothelial growth factor receptor 2
LigandBDBM50321899
Substrate/Competitorn/a
Meas. Tech.ChEMBL_642157 (CHEMBL1176708)
IC50 4.7±n/a nM
Citation Khanwelkar, RRChen, GSWang, HCYu, CWHuang, CHLee, OChen, CHHwang, CSKo, CHChou, NTLin, MWWang, LMChen, YCHseu, THChang, CNHsu, HCLin, HCShih, YCChou, SHTseng, HWLiu, CPTu, CMHu, TLTsai, YJChern, JW Synthesis and structure-activity relationship of 6-arylureido-3-pyrrol-2-ylmethylideneindolin-2-one derivatives as potent receptor tyrosine kinase inhibitors. Bioorg Med Chem18:4674-86 (2011) 
 
Vascular endothelial growth factor receptor 2
Name:Vascular endothelial growth factor receptor 2
Type:Receptor Tyrosine Kinase
Mol. Mass.:151510.97
Organism:Homo sapiens (Human)
Description:P35968
Residue:1356
BDBM50321899
NameBDBM50321899
Synonyms:(Z)-(5-{6-[3-(4-Methoxyphenyl)-ureido]-2-oxo-1,2-dihydroindol-3-ylidene-methyl}-2,4-dimethyl-1H-pyrrol-3-yl)acetic acid | CHEMBL1173150
TypeSmall organic molecule
Emp. Form.C25H24N4O5
Mol. Mass.460.4819
SMILESCOc1ccc(NC(=O)Nc2ccc3\C(=C\c4[nH]c(C)c(CC(O)=O)c4C)C(=O)Nc3c2)cc1