Reaction Details
TargetVascular endothelial growth factor receptor 2
LigandBDBM50321901
Substrate/Competitorn/a
Meas. Tech.ChEMBL_642157 (CHEMBL1176708)
IC50>1000±n/a nM
Citation Khanwelkar, RRChen, GSWang, HCYu, CWHuang, CHLee, OChen, CHHwang, CSKo, CHChou, NTLin, MWWang, LMChen, YCHseu, THChang, CNHsu, HCLin, HCShih, YCChou, SHTseng, HWLiu, CPTu, CMHu, TLTsai, YJChern, JW Synthesis and structure-activity relationship of 6-arylureido-3-pyrrol-2-ylmethylideneindolin-2-one derivatives as potent receptor tyrosine kinase inhibitors. Bioorg Med Chem18:4674-86 (2011) 
 
Vascular endothelial growth factor receptor 2
Name:Vascular endothelial growth factor receptor 2
Type:Receptor Tyrosine Kinase
Mol. Mass.:151510.97
Organism:Homo sapiens (Human)
Description:P35968
Residue:1356
BDBM50321901
NameBDBM50321901
Synonyms:(Z)-4-Methyl-5-[2-oxo-6-(3-phenylureido)-1,2-dihydroindol-3-ylidenemethyl]-1H-pyrrole-2-carboxylic acid | CHEMBL1173542
TypeSmall organic molecule
Emp. Form.C22H18N4O4
Mol. Mass.402.4027
SMILESCc1cc([nH]c1\C=C1/C(=O)Nc2cc(NC(=O)Nc3ccccc3)ccc12)C(O)=O