Reaction Details
TargetVascular endothelial growth factor receptor 3
LigandBDBM50321907
Substrate/Competitorn/a
Meas. Tech.ChEMBL_642156 (CHEMBL1176707)
IC50 8.7±n/a nM
Citation Khanwelkar, RRChen, GSWang, HCYu, CWHuang, CHLee, OChen, CHHwang, CSKo, CHChou, NTLin, MWWang, LMChen, YCHseu, THChang, CNHsu, HCLin, HCShih, YCChou, SHTseng, HWLiu, CPTu, CMHu, TLTsai, YJChern, JW Synthesis and structure-activity relationship of 6-arylureido-3-pyrrol-2-ylmethylideneindolin-2-one derivatives as potent receptor tyrosine kinase inhibitors. Bioorg Med Chem18:4674-86 (2011) 
 
Vascular endothelial growth factor receptor 3
Name:Vascular endothelial growth factor receptor 3
Type:Protein
Mol. Mass.:152749.58
Organism:Homo sapiens (Human)
Description:P35916-2
Residue:1363
BDBM50321907
NameBDBM50321907
Synonyms:(Z)-1-(4-Chlorophenyl)-3-[2-oxo-3-(1H-pyrrol-2-ylmethylene)-2,3-dihydro-1H-indol-6-yl]urea | CHEMBL1172886
TypeSmall organic molecule
Emp. Form.C20H15ClN4O2
Mol. Mass.378.812
SMILESClc1ccc(NC(=O)Nc2ccc3\C(=C\c4ccc[nH]4)C(=O)Nc3c2)cc1