Reaction Details
TargetProto-oncogene tyrosine-protein kinase Src
LigandBDBM50321961
Substrate/Competitorn/a
Meas. Tech.ChEMBL_642324 (CHEMBL1177350)
IC50 100±n/a nM
Citation Huang, HMa, JShi, JMeng, LJiang, HDing, JLiu, H Discovery of novel purine derivatives with potent and selective inhibitory activity against c-Src tyrosine kinase. Bioorg Med Chem18:4615-24 (2011) 
 
Proto-oncogene tyrosine-protein kinase Src
Name:Proto-oncogene tyrosine-protein kinase Src
Type:Protein
Mol. Mass.:59838.60
Organism:Homo sapiens (Human)
Description:P12931
Residue:536
BDBM50321961
NameBDBM50321961
Synonyms:CHEMBL1173309 | N-(3-Aminosulfonylphenyl)-2-(piperazin-1-yl)-9Hpurin-6-amine
TypeSmall organic molecule
Emp. Form.C15H18N8O2S
Mol. Mass.374.421
SMILESNS(=O)(=O)c1cccc(Nc2nc(nc3nc[nH]c23)N2CCNCC2)c1