Reaction Details
TargetProto-oncogene tyrosine-protein kinase Src
LigandBDBM50321985
Substrate/Competitorn/a
Meas. Tech.ChEMBL_642324 (CHEMBL1177350)
IC50 1590±n/a nM
Citation Huang, HMa, JShi, JMeng, LJiang, HDing, JLiu, H Discovery of novel purine derivatives with potent and selective inhibitory activity against c-Src tyrosine kinase. Bioorg Med Chem18:4615-24 (2011) 
 
Proto-oncogene tyrosine-protein kinase Src
Name:Proto-oncogene tyrosine-protein kinase Src
Type:Protein
Mol. Mass.:59838.60
Organism:Homo sapiens (Human)
Description:P12931
Residue:536
BDBM50321985
NameBDBM50321985
Synonyms:CHEMBL1172960 | N-(4-Acetamidophenyl)-2-(4-(2-hydroxyethyl)piperazin-1-yl)-9H-purin-6-amine
TypeSmall organic molecule
Emp. Form.C19H24N8O2
Mol. Mass.396.4463
SMILESCC(=O)Nc1ccc(Nc2nc(nc3nc[nH]c23)N2CCN(CCO)CC2)cc1