Reaction Details
TargetEpidermal growth factor receptor
LigandBDBM50321943
Substrate/Competitorn/a
Meas. Tech.ChEMBL_642329 (CHEMBL1177355)
IC50 10000±n/a nM
Citation Huang, HMa, JShi, JMeng, LJiang, HDing, JLiu, H Discovery of novel purine derivatives with potent and selective inhibitory activity against c-Src tyrosine kinase. Bioorg Med Chem18:4615-24 (2011) 
 
Epidermal growth factor receptor
Name:Epidermal growth factor receptor
Type:Receptor Kinase Domain
Mol. Mass.:134279.59
Organism:Homo sapiens (Human)
Description:P00533
Residue:1210
BDBM50321943
NameBDBM50321943
Synonyms:CHEMBL1172957 | N-(4-Aminosulfonylphenyl)-2-morpholino-9H-purin-6-amine
TypeSmall organic molecule
Emp. Form.C15H17N7O3S
Mol. Mass.375.406
SMILESNS(=O)(=O)c1ccc(Nc2nc(nc3nc[nH]c23)N2CCOCC2)cc1