Reaction Details
TargetAromatase
LigandBDBM50322044
Substrate/Competitorn/a
Meas. Tech.ChEMBL_642469 (CHEMBL1175842)
IC50 70±n/a nM
Citation Sun, BHoshino, JJermihov, KMarler, LPezzuto, JMMesecar, ADCushman, M Design, synthesis, and biological evaluation of resveratrol analogues as aromatase and quinone reductase 2 inhibitors for chemoprevention of cancer. Bioorg Med Chem18:5352-66 (2010) 
 
Aromatase
Name:Aromatase
Type:Enzyme
Mol. Mass.:57888.92
Organism:Homo sapiens (Human)
Description:P11511
Residue:503
BDBM50322044
NameBDBM50322044
Synonyms:(Z)-1-(3-(3,5-Dimethoxyphenyl)-2-(4-nitrophenyl)allyl)-1H-imidazole | CHEMBL1170678
TypeSmall organic molecule
Emp. Form.C20H19N3O4
Mol. Mass.365.3826
SMILESCOc1cc(OC)cc(\C=C(/Cn2ccnc2)c2ccc(cc2)[N+]([O-])=O)c1