Reaction Details
TargetAromatase
LigandBDBM50131692
Substrate/Competitorn/a
Meas. Tech.ChEMBL_642469 (CHEMBL1175842)
IC50 590±n/a nM
Citation Sun, BHoshino, JJermihov, KMarler, LPezzuto, JMMesecar, ADCushman, M Design, synthesis, and biological evaluation of resveratrol analogues as aromatase and quinone reductase 2 inhibitors for chemoprevention of cancer. Bioorg Med Chem18:5352-66 (2010) 
 
Aromatase
Name:Aromatase
Type:Enzyme
Mol. Mass.:57888.92
Organism:Homo sapiens (Human)
Description:P11511
Residue:503
BDBM50131692
NameBDBM50131692
Synonyms:3,5-Dimethoxy-4'-amino-trans-stilbene CHEMBL324290 | trans-3,5-dimethoxyl-4'-aminostilbene
TypeSmall organic molecule
Emp. Form.C16H17NO2
Mol. Mass.255.3117
SMILESCOc1cc(OC)cc(\C=C\c2ccc(N)cc2)c1