Reaction Details
TargetAromatase
LigandBDBM50322055
Substrate/Competitorn/a
Meas. Tech.ChEMBL_642469 (CHEMBL1175842)
IC50 21860±n/a nM
Citation Sun, BHoshino, JJermihov, KMarler, LPezzuto, JMMesecar, ADCushman, M Design, synthesis, and biological evaluation of resveratrol analogues as aromatase and quinone reductase 2 inhibitors for chemoprevention of cancer. Bioorg Med Chem18:5352-66 (2010) 
 
Aromatase
Name:Aromatase
Type:Enzyme
Mol. Mass.:57888.92
Organism:Homo sapiens (Human)
Description:P11511
Residue:503
BDBM50322055
NameBDBM50322055
Synonyms:(E)-3-(2-(Benzo[d][1,3]dioxol-5-yl)vinyl)benzenamine | CHEMBL1173129
TypeSmall organic molecule
Emp. Form.C15H13NO2
Mol. Mass.239.2692
SMILESNc1cccc(\C=C\c2ccc3OCOc3c2)c1