Reaction Details
TargetAromatase
LigandBDBM50322057
Substrate/Competitorn/a
Meas. Tech.ChEMBL_642469 (CHEMBL1175842)
IC50 8330±n/a nM
Citation Sun, BHoshino, JJermihov, KMarler, LPezzuto, JMMesecar, ADCushman, M Design, synthesis, and biological evaluation of resveratrol analogues as aromatase and quinone reductase 2 inhibitors for chemoprevention of cancer. Bioorg Med Chem18:5352-66 (2010) 
 
Aromatase
Name:Aromatase
Type:Enzyme
Mol. Mass.:57888.92
Organism:Homo sapiens (Human)
Description:P11511
Residue:503
BDBM50322057
NameBDBM50322057
Synonyms:3-Nitro-4'-nitro-trans-stilbene | CHEMBL1173131
TypeSmall organic molecule
Emp. Form.C14H10N2O4
Mol. Mass.270.2402
SMILES[O-][N+](=O)c1ccc(\C=C\c2cccc(c2)[N+]([O-])=O)cc1