Reaction Details
TargetAromatase
LigandBDBM50322060
Substrate/Competitorn/a
Meas. Tech.ChEMBL_642469 (CHEMBL1175842)
IC50 670±n/a nM
Citation Sun, BHoshino, JJermihov, KMarler, LPezzuto, JMMesecar, ADCushman, M Design, synthesis, and biological evaluation of resveratrol analogues as aromatase and quinone reductase 2 inhibitors for chemoprevention of cancer. Bioorg Med Chem18:5352-66 (2010) 
 
Aromatase
Name:Aromatase
Type:Enzyme
Mol. Mass.:57888.92
Organism:Homo sapiens (Human)
Description:P11511
Residue:503
BDBM50322060
NameBDBM50322060
Synonyms:4-(3,4-Dimethoxyphenethyl)aniline | CHEMBL1171680
TypeSmall organic molecule
Emp. Form.C16H19NO2
Mol. Mass.257.3276
SMILESCOc1ccc(CCc2ccc(N)cc2)cc1OC