Reaction Details
TargetAromatase
LigandBDBM50322065
Substrate/Competitorn/a
Meas. Tech.ChEMBL_642469 (CHEMBL1175842)
IC50 2940±n/a nM
Citation Sun, BHoshino, JJermihov, KMarler, LPezzuto, JMMesecar, ADCushman, M Design, synthesis, and biological evaluation of resveratrol analogues as aromatase and quinone reductase 2 inhibitors for chemoprevention of cancer. Bioorg Med Chem18:5352-66 (2010) 
 
Aromatase
Name:Aromatase
Type:Enzyme
Mol. Mass.:57888.92
Organism:Homo sapiens (Human)
Description:P11511
Residue:503
BDBM50322065
NameBDBM50322065
Synonyms:3,5-Diacetoxy-4'-amino-trans-stilbene | CHEMBL1172400
TypeSmall organic molecule
Emp. Form.C18H17NO4
Mol. Mass.311.3319
SMILESCC(=O)Oc1cc(OC(C)=O)cc(\C=C\c2ccc(N)cc2)c1