Reaction Details
Target6-phosphogluconate dehydrogenase, decarboxylating
LigandBDBM50148765
Substrate/Competitorn/a
Meas. Tech.ChEMBL_642682 (CHEMBL1176974)
Ki 360±n/a nM
Citation Ruda, GFCampbell, GAlibu, VPBarrett, MPBrenk, RGilbert, IH Virtual fragment screening for novel inhibitors of 6-phosphogluconate dehydrogenase. Bioorg Med Chem18:5056-62 (2010) 
 
6-phosphogluconate dehydrogenase, decarboxylating
Name:6-phosphogluconate dehydrogenase, decarboxylating
Type:PROTEIN
Mol. Mass.:52976.41
Organism:Ovis aries
Description:ChEMBL_642682
Residue:483
BDBM50148765
NameBDBM50148765
Synonyms:1-(hydroxyamino)-1-oxo-4-(phosphonooxy)butane-2,3-diyl diacetate CHEMBL114269
TypeSmall organic molecule
Emp. Form.C8H14NO10P
Mol. Mass.315.1712
SMILESCC(=O)O[C@H](COP(O)(O)=O)[C@@H](OC(C)=O)C(=O)NO