Reaction Details
TargetCathepsin B
LigandBDBM50322346
Substrate/Competitorn/a
Meas. Tech.ChEMBL_642741 (CHEMBL1177221)
Ki 25000±n/a nM
Citation Bova, FEttari, RMicale, NCarnovale, CSchirmeister, TGelhaus, CLeippe, MGrasso, SZappalà, M Constrained peptidomimetics as antiplasmodial falcipain-2 inhibitors. Bioorg Med Chem18:4928-38 (2010) 
 
Cathepsin B
Name:Cathepsin B
Type:Enzyme
Mol. Mass.:37819.69
Organism:Homo sapiens (Human)
Description:gi_63102437
Residue:339
BDBM50322346
NameBDBM50322346
Synonyms:(R)-Methyl4-(2-(3-((naphthalen-1-ylcarbamoyloxy)methyl)-2-oxo-5-phenyl-2,3-dihydro-1H-benzo[e][1,4]diazepin-1-yl)acetamido)but-2-enoate | CHEMBL1171636
TypeSmall organic molecule
Emp. Form.C34H30N4O6
Mol. Mass.590.6252
SMILESCOC(=O)\C=C\CNC(=O)CN1c2ccccc2C(=N[C@H](COC(=O)Nc2cccc3ccccc23)C1=O)c1ccccc1