Reaction Details
TargetProcathepsin L
LigandBDBM50322345
Substrate/Competitorn/a
Meas. Tech.ChEMBL_642742 (CHEMBL1177222)
Ki 12000±n/a nM
Citation Bova, FEttari, RMicale, NCarnovale, CSchirmeister, TGelhaus, CLeippe, MGrasso, SZappalà, M Constrained peptidomimetics as antiplasmodial falcipain-2 inhibitors. Bioorg Med Chem18:4928-38 (2010) 
 
Procathepsin L
Name:Procathepsin L
Type:Enzyme
Mol. Mass.:37557.19
Organism:Homo sapiens (Human)
Description:Purchased from Calbiochem (San Diego, CA).
Residue:333
BDBM50322345
NameBDBM50322345
Synonyms:(R)-Methyl4-(2-(3-((4-methoxyphenylcarbamoyloxy)methyl)-2-oxo-5-phenyl-2,3-dihydro-1H-benzo[e][1,4]diazepin-1-yl)acetamido)but-2-enoate | CHEMBL1171635
TypeSmall organic molecule
Emp. Form.C31H30N4O7
Mol. Mass.570.5925
SMILESCOC(=O)\C=C\CNC(=O)CN1c2ccccc2C(=N[C@H](COC(=O)Nc2ccc(OC)cc2)C1=O)c1ccccc1