Reaction Details
TargetProcathepsin L
LigandBDBM50322347
Substrate/Competitorn/a
Meas. Tech.ChEMBL_642742 (CHEMBL1177222)
Ki 2700±n/a nM
Citation Bova, FEttari, RMicale, NCarnovale, CSchirmeister, TGelhaus, CLeippe, MGrasso, SZappalà, M Constrained peptidomimetics as antiplasmodial falcipain-2 inhibitors. Bioorg Med Chem18:4928-38 (2010) 
 
Procathepsin L
Name:Procathepsin L
Type:Enzyme
Mol. Mass.:37557.19
Organism:Homo sapiens (Human)
Description:Purchased from Calbiochem (San Diego, CA).
Residue:333
BDBM50322347
NameBDBM50322347
Synonyms:(R)-Methyl4-(2-(3-((butylcarbamoyloxy)methyl)-2-oxo-5-phenyl-2,3-dihydro-1H-benzo[e][1,4]diazepin-1-yl)acetamido)but-2-enoate | CHEMBL1171093
TypeSmall organic molecule
Emp. Form.C28H32N4O6
Mol. Mass.520.5769
SMILESCCCCNC(=O)OC[C@H]1N=C(c2ccccc2)c2ccccc2N(CC(=O)NC\C=C\C(=O)OC)C1=O