Reaction Details
TargetFalcipain 2
LigandBDBM50322348
Substrate/Competitorn/a
Meas. Tech.ChEMBL_642736 (CHEMBL1177216)
Ki 89000±n/a nM
Citation Bova, FEttari, RMicale, NCarnovale, CSchirmeister, TGelhaus, CLeippe, MGrasso, SZappalà, M Constrained peptidomimetics as antiplasmodial falcipain-2 inhibitors. Bioorg Med Chem18:4928-38 (2010) 
 
Falcipain 2
Name:Falcipain 2
Type:Enzyme
Mol. Mass.:55912.60
Organism:Plasmodium falciparum
Description:Recombinant falcipain-2.
Residue:484
BDBM50322348
NameBDBM50322348
Synonyms:(R)-Methyl4-(2-(3-((cyclohexylcarbamoyloxy)methyl)-2-oxo-5-phenyl-2,3-dihydro-1H-benzo[e][1,4]diazepin-1-yl)acetamido)but-2-enoate | CHEMBL1171094
TypeSmall organic molecule
Emp. Form.C30H34N4O6
Mol. Mass.546.6142
SMILESCOC(=O)\C=C\CNC(=O)CN1c2ccccc2C(=N[C@H](COC(=O)NC2CCCCC2)C1=O)c1ccccc1