Reaction Details
TargetCarbonic anhydrase 12
LigandBDBM50263418
Substrate/Competitorn/a
Meas. Tech.ChEMBL_642829 (CHEMBL1177459)
Ki 128±n/a nM
Citation Wagner, JAvvaru, BSRobbins, AHScozzafava, ASupuran, CTMcKenna, R Coumarinyl-substituted sulfonamides strongly inhibit several human carbonic anhydrase isoforms: solution and crystallographic investigations. Bioorg Med Chem18:4873-8 (2010) 
 
Carbonic anhydrase 12
Name:Carbonic anhydrase 12
Type:Enzyme
Mol. Mass.:39456.00
Organism:Homo sapiens (Human)
Description:Catalytic domain of human cloned isozyme was used in the assay
Residue:354
BDBM50263418
NameBDBM50263418
Synonyms:2-(7-Methoxy-2-oxo-2H-chromen-4-yl)-N-(2-sulfamoyl-phenyl)-acetamide CHEMBL514556
TypeSmall organic molecule
Emp. Form.C18H16N2O6S
Mol. Mass.388.394
SMILESCOc1ccc2c(CC(=O)Nc3ccccc3S(N)(=O)=O)cc(=O)oc2c1