Reaction Details
TargetCarbonic anhydrase 2
LigandBDBM50264007
Substrate/Competitorn/a
Meas. Tech.ChEMBL_642827 (CHEMBL1177457)
Ki 36±n/a nM
Citation Wagner, JAvvaru, BSRobbins, AHScozzafava, ASupuran, CTMcKenna, R Coumarinyl-substituted sulfonamides strongly inhibit several human carbonic anhydrase isoforms: solution and crystallographic investigations. Bioorg Med Chem18:4873-8 (2010) 
 
Carbonic anhydrase 2
Name:Carbonic anhydrase 2
Type:Enzyme
Mol. Mass.:29250.71
Organism:Homo sapiens (Human)
Description:P00918
Residue:260
BDBM50264007
NameBDBM50264007
Synonyms:CHEMBL489182 N-(2,4-disulfamoyl-5-(trifluoromethyl)phenyl)-2-(7-methoxy-2-oxo-2H-chromen-4-yl)acetamide
TypeSmall organic molecule
Emp. Form.C19H16F3N3O8S2
Mol. Mass.535.471
SMILESCOc1ccc2c(CC(=O)Nc3cc(c(cc3S(N)(=O)=O)S(N)(=O)=O)C(F)(F)F)cc(=O)oc2c1