Reaction Details
TargetSodium-dependent serotonin transporter
LigandBDBM50322698
Substrate/Competitorn/a
Meas. Tech.ChEMBL_642191 (CHEMBL1176742)
Ki 1.58±n/a nM
Citation Micheli, FCavanni, PAndreotti, DArban, RBenedetti, RBertani, BBettati, MBettelini, LBonanomi, GBraggio, SCarletti, RChecchia, ACorsi, MFazzolari, EFontana, SMarchioro, CMerlo-Pich, ENegri, MOliosi, BRatti, ERead, KDRoscic, MSartori, ISpada, STedesco, GTarsi, LTerreni, SVisentini, FZocchi, AZonzini, LDi Fabio, R 6-(3,4-dichlorophenyl)-1-[(methyloxy)methyl]-3-azabicyclo[4.1.0]heptane: a new potent and selective triple reuptake inhibitor. J Med Chem53:4989-5001 (2010) 
 
Sodium-dependent serotonin transporter
Name:Sodium-dependent serotonin transporter
Type:Enzyme Catalytic Domain
Mol. Mass.:70044.92
Organism:MOUSE
Description:5-HT Transporter SLC6A4 MOUSE::Q60857
Residue:630
BDBM50322698
NameBDBM50322698
Synonyms:rel-1-(3,4-dichlorophenyl)-6-(methoxymethyl)-3-azabicyclo[4.1.0]heptane
TypeSmall organic molecule
Emp. Form.C14H17Cl2NO
Mol. Mass.286.197
SMILESCOC[C@]12C[C@]1(CCNC2)c1ccc(Cl)c(Cl)c1