Reaction Details
TargetBeta-secretase 1
LigandBDBM50322891
Substrate/Competitorn/a
Meas. Tech.ChEMBL_644686 (CHEMBL1211665)
IC50 8±n/a nM
Citation Clarke, BCutler, LDemont, EDingwall, CDunsdon, RHawkins, JHowes, CHussain, IMaile, GMatico, RMosley, JNaylor, AO'Brien, ARedshaw, SRowland, PSoleil, VSmith, KJSweitzer, STheobald, PVesey, DWalter, DSWayne, G BACE-1 hydroxyethylamine inhibitors using novel edge-to-face interaction with Arg-296. Bioorg Med Chem Lett20:4639-44 (2010) 
 
Beta-secretase 1
Name:Beta-secretase 1
Type:Protein
Mol. Mass.:55755.10
Organism:Homo sapiens (Human)
Description:P56817
Residue:501
BDBM50322891
NameBDBM50322891
Synonyms:3-(N-(3-cyanophenyl)methylsulfonamido)-N-((2S,3R)-4-((S)-1-(cyclohexylamino)-1-oxopropan-2-ylamino)-3-hydroxy-1-phenylbutan-2-yl)benzamide | CHEMBL1210344
TypeSmall organic molecule
Emp. Form.C34H41N5O5S
Mol. Mass.631.785
SMILESC[C@H](NC[C@@H](O)[C@H](Cc1ccccc1)NC(=O)c1cccc(c1)N(c1cccc(c1)C#N)S(C)(=O)=O)C(=O)NC1CCCCC1