Reaction Details
TargetAndrogen receptor
LigandBDBM50323026
Substrate/Competitorn/a
Meas. Tech.ChEMBL_643543 (CHEMBL1212407)
IC50 1456±n/a nM
Citation Xiao, HYBalog, AAttar, RMFairfax, DFleming, LBHolst, CLMartin, GSRossiter, LMChen, JCvjic, MEDell-John, JGeng, JGottardis, MMHan, WCNation, AObermeier, MRizzo, CASchweizer, LSpires, TShan, WGavai, ASalvati, MEVite, G Design and synthesis of 4-[3,5-dioxo-11-oxa-4,9-diazatricyclo[5.3.1.0(2,6)]undec-4-yl]-2-trifluoromethyl-benzonitriles as androgen receptor antagonists. Bioorg Med Chem Lett20:4491-5 (2010) 
 
Androgen receptor
Name:Androgen receptor
Type:Receptor
Mol. Mass.:99185.27
Organism:Homo sapiens (Human)
Description:CHO cells were stably transfected with human AR gene.
Residue:920
BDBM50323026
NameBDBM50323026
Synonyms:(1S,2S,6R,7R)-4-(4-Cyano-3-trifluoromethyl-phenyl)-1,7-dimethyl-3,5-dioxo-11-oxa-4,9-diaza-tricyclo[5.3.1.0*2,6*]undecane-9-carboxylic acid ethylamide | CHEMBL1210907
TypeSmall organic molecule
Emp. Form.C21H21F3N4O4
Mol. Mass.450.411
SMILESCCNC(=O)N1C[C@]2(C)O[C@](C)(C1)c1c(O)n(c(O)c21)-c1ccc(C#N)c(c1)C(F)(F)F