Reaction Details
TargetAndrogen receptor
LigandBDBM50323039
Substrate/Competitorn/a
Meas. Tech.ChEMBL_643540 (CHEMBL1212404)
Ki 6.1±n/a nM
Citation Xiao, HYBalog, AAttar, RMFairfax, DFleming, LBHolst, CLMartin, GSRossiter, LMChen, JCvjic, MEDell-John, JGeng, JGottardis, MMHan, WCNation, AObermeier, MRizzo, CASchweizer, LSpires, TShan, WGavai, ASalvati, MEVite, G Design and synthesis of 4-[3,5-dioxo-11-oxa-4,9-diazatricyclo[5.3.1.0(2,6)]undec-4-yl]-2-trifluoromethyl-benzonitriles as androgen receptor antagonists. Bioorg Med Chem Lett20:4491-5 (2010) 
 
Androgen receptor
Name:Androgen receptor
Type:Receptor
Mol. Mass.:99185.27
Organism:Homo sapiens (Human)
Description:CHO cells were stably transfected with human AR gene.
Residue:920
BDBM50323039
NameBDBM50323039
Synonyms:4-((1S,2S,6R,7R)-1,7-Dimethyl-3,5-dioxo-9-pyrimidin-2-yl-11-oxa-4,9-diaza-tricyclo[5.3.1.0*2,6*]undec-4-yl)-2-trifluoromethyl-benzonitrile | CHEMBL1210214
TypeSmall organic molecule
Emp. Form.C22H18F3N5O3
Mol. Mass.457.4052
SMILESC[C@@]12CN(C[C@@](C)(O1)c1c(O)n(c(O)c21)-c1ccc(C#N)c(c1)C(F)(F)F)c1ncccn1