Reaction Details
TargetCarbonic anhydrase 9
LigandBDBM10868
Substrate/Competitorn/a
Meas. Tech.ChEMBL_643931 (CHEMBL1211830)
Ki 41±n/a nM
Citation Avvaru, BSWagner, JMMaresca, AScozzafava, ARobbins, AHSupuran, CTMcKenna, R Carbonic anhydrase inhibitors. The X-ray crystal structure of human isoform II in adduct with an adamantyl analogue of acetazolamide resides in a less utilized binding pocket than most hydrophobic inhibitors. Bioorg Med Chem Lett20:4376-81 (2010) 
 
Carbonic anhydrase 9
Name:Carbonic anhydrase 9
Type:Enzyme
Mol. Mass.:49669.03
Organism:Homo sapiens (Human)
Description:Catalytic domain of human cloned isozyme was used in the assay
Residue:459
BDBM10868
NameBDBM10868
Synonyms:1,3,4-Thiadiazole-2-sulfonamide, 6 5-Amino-1,3,4-thiadiazole-2-sulphonamide (1) CHEMBL265674 | aromatic/heteroaromatic sulfonamide 13
TypeSmall organic molecule
Emp. Form.C2H4N4O2S2
Mol. Mass.180.209
SMILESNc1nnc(s1)S(N)(=O)=O