Reaction Details
TargetCarbonic anhydrase 14
LigandBDBM50108563
Substrate/Competitorn/a
Meas. Tech.ChEMBL_643934 (CHEMBL1211833)
Ki 7.5±n/a nM
Citation Avvaru, BSWagner, JMMaresca, AScozzafava, ARobbins, AHSupuran, CTMcKenna, R Carbonic anhydrase inhibitors. The X-ray crystal structure of human isoform II in adduct with an adamantyl analogue of acetazolamide resides in a less utilized binding pocket than most hydrophobic inhibitors. Bioorg Med Chem Lett20:4376-81 (2010) 
 
Carbonic anhydrase 14
Name:Carbonic anhydrase 14
Type:Enzyme
Mol. Mass.:37665.67
Organism:Homo sapiens (Human)
Description:Human (cloned) isozyme.
Residue:337
BDBM50108563
NameBDBM50108563
Synonyms:Adamantane-1-carboxylic acid (5-sulfamoyl-[1,3,4]thiadiazol-2-yl)-amide | CHEMBL108971
TypeSmall organic molecule
Emp. Form.C13H18N4O3S2
Mol. Mass.342.437
SMILESNS(=O)(=O)c1nnc(NC(=O)C23C[C@H]4C[C@H](C[C@H](C4)C2)C3)s1