Reaction Details
TargetCarbonic anhydrase 4
LigandBDBM50323341
Substrate/Competitorn/a
Meas. Tech.ChEMBL_643926 (CHEMBL1211825)
Ki 413±n/a nM
Citation Avvaru, BSWagner, JMMaresca, AScozzafava, ARobbins, AHSupuran, CTMcKenna, R Carbonic anhydrase inhibitors. The X-ray crystal structure of human isoform II in adduct with an adamantyl analogue of acetazolamide resides in a less utilized binding pocket than most hydrophobic inhibitors. Bioorg Med Chem Lett20:4376-81 (2010) 
 
Carbonic anhydrase 4
Name:Carbonic anhydrase 4
Type:Enzyme
Mol. Mass.:35037.98
Organism:Homo sapiens (Human)
Description:P22748
Residue:312
BDBM50323341
NameBDBM50323341
Synonyms:CHEMBL1209039
TypeSmall organic molecule
Emp. Form.C14H20N4O3S2
Mol. Mass.356.464
SMILESNS(=O)(=O)c1nnc(NC(=O)CC23CC4CC(CC(C4)C2)C3)s1