Reaction Details
TargetTranscriptional activator protein LuxR
LigandBDBM50323389
Substrate/Competitorn/a
Meas. Tech.ChEMBL_643998 (CHEMBL1211897)
IC50 7000±n/a nM
Citation Soulère, LSabbah, MFontaine, FQueneau, YDoutheau, A LuxR-dependent quorum sensing: computer aided discovery of new inhibitors structurally unrelated to N-acylhomoserine lactones. Bioorg Med Chem Lett20:4355-8 (2010) 
 
Transcriptional activator protein LuxR
Name:Transcriptional activator protein LuxR
Type:PROTEIN
Mol. Mass.:28563.86
Organism:Vibrio fischeri
Description:ChEMBL_831639
Residue:250
BDBM50323389
NameBDBM50323389
Synonyms:CHEMBL1208858 | Calmidazolium
TypeSmall organic molecule
Emp. Form.C31H23Cl6N2O
Mol. Mass.652.245
SMILESClc1ccc(cc1)C(c1ccc(Cl)cc1)[n+]1ccn(CC(OCc2ccc(Cl)cc2Cl)c2ccc(Cl)cc2Cl)c1