Reaction Details
TargetMitogen-activated protein kinase 14
LigandBDBM50323660
Substrate/Competitorn/a
Meas. Tech.ChEMBL_645060 (CHEMBL1211566)
IC50 25±n/a nM
Citation Montalban, AGBoman, EChang, CDCeide, SCDahl, RDalesandro, DDelaet, NGErb, EErnst, JTGibbs, AKahl, JKessler, LKucharski, JLum, CLundström, JMiller, SNakanishi, HRoberts, ESaiah, ESullivan, RUrban, JWang, ZLarson, CJ Optimization of alpha-ketoamide based p38 inhibitors through modifications to the region that binds to the allosteric site. Bioorg Med Chem Lett20:4819-24 (2010) 
 
Mitogen-activated protein kinase 14
Name:Mitogen-activated protein kinase 14
Type:Serine/threonine-protein kinase
Mol. Mass.:41286.76
Organism:Homo sapiens (Human)
Description:Q16539
Residue:360
BDBM50323660
NameBDBM50323660
Synonyms:CHEMBL1208891 | N-(5-tert-butyl-2-methoxy-3-(methylsulfonamido)phenyl)-2-oxo-2-(4-(pyridin-4-ylamino)naphthalen-1-yl)acetamide
TypeSmall organic molecule
Emp. Form.C29H30N4O5S
Mol. Mass.546.637
SMILESCOc1c(NC(=O)C(=O)c2ccc(Nc3ccncc3)c3ccccc23)cc(cc1NS(C)(=O)=O)C(C)(C)C