Reaction Details
TargetPotassium voltage-gated channel subfamily H member 2
LigandBDBM50323669
Substrate/Competitorn/a
Meas. Tech.ChEMBL_645081 (CHEMBL1211587)
Ki 2160±n/a nM
Citation Lowe, JADeNinno, SLCoe, JWZhang, LMente, SHurst, RSMather, RJWard, KMShrikhande, ARollema, HJohnson, DEHorner, WGorczyca, RTingley, FDKozak, RMajchrzak, MJTritto, TSadlier, JShaffer, CLEllerbrock, BOsgood, SMMacDougall, MCMcDowell, LL A novel series of [3.2.1] azabicyclic biaryl ethers as alpha3beta4 and alpha6/4beta4 nicotinic receptor agonists. Bioorg Med Chem Lett20:4749-52 (2010) 
 
Potassium voltage-gated channel subfamily H member 2
Name:Potassium voltage-gated channel subfamily H member 2
Type:Multi-pass membrane protein
Mol. Mass.:126672.65
Organism:Homo sapiens (Human)
Description:Q12809
Residue:1159
BDBM50323669
NameBDBM50323669
Synonyms:(1R,6S,5R)-[6-(2-(Pyridin-3-yl)phenoxy))]-3-azabicyclo[3.2.1]octane hydrochloride rac-exo-[6-(2-(pyridin-3-yl)phenoxy))]-3-azabicyclo[3.2.1]octane hydrochloride
TypeSmall organic molecule
Emp. Form.C18H20N2O
Mol. Mass.280.3642
SMILESC1[C@@H]2C[C@H](Oc3ccccc3-c3cccnc3)[C@H]1CNC2