Reaction Details
TargetCannabinoid receptor 1
LigandBDBM50324649
Substrate/Competitorn/a
Meas. Tech.ChEMBL_649739 (CHEMBL1219437)
Ki>10000±n/a nM
Citation Pasquini, SLigresti, AMugnaini, CSemeraro, TCicione, LDe Rosa, MGuida, FLuongo, LDe Chiaro, MCascio, MGBolognini, DMarini, PPertwee, RMaione, SDi Marzo, VCorelli, F Investigations on the 4-quinolone-3-carboxylic acid motif. 3. Synthesis, structure-affinity relationships, and pharmacological characterization of 6-substituted 4-quinolone-3-carboxamides as highly selective cannabinoid-2 receptor ligands. J Med Chem53:5915-28 (2010) 
 
Cannabinoid receptor 1
Name:Cannabinoid receptor 1
Type:G Protein-Coupled Receptor (GPCR)
Mol. Mass.:52868.96
Organism:Homo sapiens (Human)
Description:P21554
Residue:472
BDBM50324649
NameBDBM50324649
Synonyms:CHEMBL1215889 | N-(Adamantan-1-yl)-4-oxo-1-pentyl-6-(2-phenylethynyl)-1,4-dihydroquinoline-3-carboxamide
TypeSmall organic molecule
Emp. Form.C33H36N2O2
Mol. Mass.492.6511
SMILESCCCCCn1cc(C(=O)NC23CC4CC(CC(C4)C2)C3)c(=O)c2cc(ccc12)C#Cc1ccccc1