Reaction Details
TargetCannabinoid receptor 2
LigandBDBM50324639
Substrate/Competitorn/a
Meas. Tech.ChEMBL_649740 (CHEMBL1219438)
Ki 16±n/a nM
Citation Pasquini, SLigresti, AMugnaini, CSemeraro, TCicione, LDe Rosa, MGuida, FLuongo, LDe Chiaro, MCascio, MGBolognini, DMarini, PPertwee, RMaione, SDi Marzo, VCorelli, F Investigations on the 4-quinolone-3-carboxylic acid motif. 3. Synthesis, structure-affinity relationships, and pharmacological characterization of 6-substituted 4-quinolone-3-carboxamides as highly selective cannabinoid-2 receptor ligands. J Med Chem53:5915-28 (2010) 
 
Cannabinoid receptor 2
Name:Cannabinoid receptor 2
Type:G Protein-Coupled Receptor (GPCR)
Mol. Mass.:39690.94
Organism:Homo sapiens (Human)
Description:P34972
Residue:360
BDBM50324639
NameBDBM50324639
Synonyms:6-(2,4-Difluoro-phenyl)-4-oxo-1-pentyl-1,4-dihydro-quinoline-3-carboxylic acid adamantan-1-ylamide | CHEMBL1215916
TypeSmall organic molecule
Emp. Form.C31H34F2N2O2
Mol. Mass.504.6107
SMILESCCCCCn1cc(C(=O)NC23CC4CC(CC(C4)C2)C3)c(=O)c2cc(ccc12)-c1ccc(F)cc1F