Reaction Details
TargetCyclin-dependent kinase 9
LigandBDBM27344
Substrate/Competitorn/a
Meas. Tech.ChEMBL_653789 (CHEMBL1226911)
IC50 34±n/a nM
Citation Montagnoli, AValsasina, BCroci, VMenichincheri, MRainoldi, SMarchesi, VTibolla, MTenca, PBrotherton, DAlbanese, CPatton, VAlzani, RCiavolella, ASola, FMolinari, AVolpi, DAvanzi, NFiorentini, FCattoni, MHealy, SBallinari, DPesenti, EIsacchi, AMoll, JBensimon, AVanotti, ESantocanale, C A Cdc7 kinase inhibitor restricts initiation of DNA replication and has antitumor activity. Nat Chem Biol4:357-65 (2008) 
 
Cyclin-dependent kinase 9
Name:Cyclin-dependent kinase 9
Type:Enzyme Subunit
Mol. Mass.:42789.13
Organism:Homo sapiens (Human)
Description:n/a
Residue:372
BDBM27344
NameBDBM27344
Synonyms:2-(pyridin-4-yl)-1H,4H,5H,6H,7H-pyrrolo[3,2-c]pyridin-4-one Pyrrolopyridinone, 1
TypeSmall organic molecule
Emp. Form.C12H11N3O
Mol. Mass.213.2352
SMILESO=C1NCCc2[nH]c(cc12)-c1ccncc1