Reaction Details
TargetSerine/threonine-protein kinase Chk2
LigandBDBM27344
Substrate/Competitorn/a
Meas. Tech.ChEMBL_653796 (CHEMBL1226918)
IC50 1100±n/a nM
Citation Montagnoli, AValsasina, BCroci, VMenichincheri, MRainoldi, SMarchesi, VTibolla, MTenca, PBrotherton, DAlbanese, CPatton, VAlzani, RCiavolella, ASola, FMolinari, AVolpi, DAvanzi, NFiorentini, FCattoni, MHealy, SBallinari, DPesenti, EIsacchi, AMoll, JBensimon, AVanotti, ESantocanale, C A Cdc7 kinase inhibitor restricts initiation of DNA replication and has antitumor activity. Nat Chem Biol4:357-65 (2008) 
 
Serine/threonine-protein kinase Chk2
Name:Serine/threonine-protein kinase Chk2
Type:Protein
Mol. Mass.:60908.59
Organism:Homo sapiens (Human)
Description:O96017
Residue:543
BDBM27344
NameBDBM27344
Synonyms:2-(pyridin-4-yl)-1H,4H,5H,6H,7H-pyrrolo[3,2-c]pyridin-4-one Pyrrolopyridinone, 1
TypeSmall organic molecule
Emp. Form.C12H11N3O
Mol. Mass.213.2352
SMILESO=C1NCCc2[nH]c(cc12)-c1ccncc1