Reaction Details
TargetAmine oxidase [flavin-containing] B
LigandBDBM50324735
Substrate/Competitorn/a
Meas. Tech.ChEMBL_651342 (CHEMBL1227162)
IC50 13000±n/a nM
Citation Geldenhuys, WJDarvesh, ASFunk, MOVan der Schyf, CJCarroll, RT Identification of novel monoamine oxidase B inhibitors by structure-based virtual screening. Bioorg Med Chem Lett20:5295-8 (2010) 
 
Amine oxidase [flavin-containing] B
Name:Amine oxidase [flavin-containing] B
Type:Protein
Mol. Mass.:58768.76
Organism:Homo sapiens (Human)
Description:P27338
Residue:520
BDBM50324735
NameBDBM50324735
Synonyms:(5E)-5-(QUINOXALIN-6-YLMETHYLENE)-1,3-THIAZOLIDINE-2,4-DIONE AS-605240 CHEMBL568150
TypeSmall organic molecule
Emp. Form.C12H7N3O2S
Mol. Mass.257.268
SMILESOC1=NC(=O)C(S1)=Cc1ccc2nccnc2c1