Reaction Details
TargetCarbonic anhydrase 5A, mitochondrial
LigandBDBM50325274
Substrate/Competitorn/a
Meas. Tech.ChEMBL_651947 (CHEMBL1227477)
Ki 730±n/a nM
Citation Innocenti, AGülçin, IScozzafava, ASupuran, CT Carbonic anhydrase inhibitors. Antioxidant polyphenols effectively inhibit mammalian isoforms I-XV. Bioorg Med Chem Lett20:5050-3 (2010) 
 
Carbonic anhydrase 5A, mitochondrial
Name:Carbonic anhydrase 5A, mitochondrial
Type:Enzyme
Mol. Mass.:34755.54
Organism:Homo sapiens (Human)
Description:Human (cloned) isozyme
Residue:305
BDBM50325274
NameBDBM50325274
Synonyms:4-{2-[3-(4-Hydroxy-phenyl)-1-methyl-propylamino]-ethyl}-benzene-1,2-diol CHEMBL926 Dobutrex | cid_36811
TypeSmall organic molecule
Emp. Form.C18H23NO3
Mol. Mass.301.3801
SMILESCC(CCc1ccc(O)cc1)NCCc1ccc(O)c(O)c1