Reaction Details
TargetCarbonic anhydrase 15
LigandBDBM60989
Substrate/Competitorn/a
Meas. Tech.ChEMBL_651955 (CHEMBL1227628)
Ki 650±n/a nM
Citation Innocenti, AGülçin, IScozzafava, ASupuran, CT Carbonic anhydrase inhibitors. Antioxidant polyphenols effectively inhibit mammalian isoforms I-XV. Bioorg Med Chem Lett20:5050-3 (2010) 
 
Carbonic anhydrase 15
Name:Carbonic anhydrase 15
Type:PROTEIN
Mol. Mass.:35484.02
Organism:Mus musculus
Description:ChEMBL_651955
Residue:324
BDBM60989
NameBDBM60989
Synonyms:(3S)-2-[(2S,3S)-2-(hydroxymethyl)-3-(3-methoxy-4-oxidanyl-phenyl)-2,3-dihydro-1,4-benzodioxin-6-yl]-3,5,7-tris(oxidanyl)-2,3-dihydrochromen-4-one (3S)-3,5,7-trihydroxy-2-[(2S,3S)-3-(4-hydroxy-3-methoxyphenyl)-2-(hydroxymethyl)-2,3-dihydro-1,4-benzodioxin-6-yl]-2,3-dihydrochromen-4-one MLS001332411 Silibinin | cid_16211710
TypeSmall organic molecule
Emp. Form.C25H22O10
Mol. Mass.482.4362
SMILESCOc1cc(ccc1O)[C@@H]1Oc2cc(ccc2O[C@H]1CO)C1Oc2cc(O)cc(O)c2C(O)C1=O